Equilenin

Kovats' RI, non-polar column, isothermal

View large format table.

Column type Active phase Temperature (C) I Reference Comment
CapillaryCP Sil 5 CB200.2837.2Novakovic, Tvrzicka, et al., 1995Column length: 10. m; Column diameter: 0.25 mm
CapillaryCP Sil 5 CB205.2863.3Novakovic, Tvrzicka, et al., 1995Column length: 10. m; Column diameter: 0.25 mm
CapillaryCP Sil 5 CB210.2862.6Novakovic, Tvrzicka, et al., 1995Column length: 10. m; Column diameter: 0.25 mm

References

Novakovic, Tvrzicka, et al., 1995
Novakovic, J.; Tvrzicka, E.; Vsetecka, V.; Pouzar, V.; Feltl, L., Capillary gas-chromatographic retention behavior and physico-chemical properties of underivatized equine estrogens, Collect. Czech. Chem. Commun., 1995, 60, 5, 813-819, https://doi.org/10.1135/cccc19950813 . [all data]