Allopregnan-3α-ol-20-one

Phase change data

Data compiled by: Thermodynamics Research Center, NIST Boulder Laboratories, Chris Muzny director

Quantity Value Units Method Reference Comment
Tfus467.KN/AFleischer, Whitman, et al., 1938Uncertainty assigned by TRC = 8. K; identification of isomer uncertain
Tfus409.KN/AMarker and Kamm, 1937Uncertainty assigned by TRC = 5. K

In addition to the Thermodynamics Research Center (TRC) data available from this site, much more physical and chemical property data is available from the following TRC products:

References

Fleischer, Whitman, et al., 1938
Fleischer, G.; Whitman, B.; Schwenk, E., Preparation of epi-allo-Pregnanol-3-one-20, J. Am. Chem. Soc., 1938, 60, 79-. [all data]

Marker and Kamm, 1937
Marker, R.E.; Kamm, O., Sterols XVII. Isolation of Pregananolone from Human Pregnancy Urine, J. Am. Chem. Soc., 1937, 59, 1373-4. [all data]