hexamethylcyclohexane

Phase change data

Data compiled by: Thermodynamics Research Center, NIST Boulder Laboratories, Chris Muzny director

Quantity Value Units Method Reference Comment
Tboil465.3KN/AChiurdoglu and Maquestiau, 1954Uncertainty assigned by TRC = 2. K
Tboil495.0KN/ASmith and Pennekamp, 1945Uncertainty assigned by TRC = 1. K
Tboil495.0KN/ASmith and Pennekamp, 1945, 2Uncertainty assigned by TRC = 1. K

In addition to the Thermodynamics Research Center (TRC) data available from this site, much more physical and chemical property data is available from the following TRC products:

References

Chiurdoglu and Maquestiau, 1954
Chiurdoglu, G.; Maquestiau, A., Alicyclic Compounds with a Quaternary Carbon I. Syntheses of Some gem-Polymethylcyclohexanes, Bull. Soc. Chim. Belg., 1954, 63, 357. [all data]

Smith and Pennekamp, 1945
Smith, H.A.; Pennekamp, E.F.H., The Catalytic Hydrogenation of the Benzene Nucleus II. The Hydrogenation of Benzene and Mono-alkylkbenzenes, J. Am. Chem. Soc., 1945, 67, 276. [all data]

Smith and Pennekamp, 1945, 2
Smith, H.A.; Pennekamp, E.F.H., The Catalytic Hydrogenation of the Benzene Nucleus III. The Hydrogenation of Polymethylbenzenes, J. Am. Chem. Soc., 1945, 67, 279. [all data]