(5R,10S)-6,10-Dimethyl-2-(prop-1-en-2-yl)spiro[4.5]deca-1,6-diene, rel-

Normal alkane RI, non-polar column, temperature ramp

Data compiled by: NIST Mass Spectrometry Data Center, William E. Wallace, director

Column type CapillaryCapillary
Active phase HP-5CP Sil 5 CB
Column length (m) 25.25.
Carrier gas He
Substrate
Column diameter (mm) 0.250.25
Phase thickness (μm) 0.250.15
Tstart (C) 50.50.
Tend (C) 300.230.
Heat rate (K/min) 5.3.
Initial hold (min) 5.
Final hold (min)
I 1481.1483.
ReferenceChampagnat, Figueredo, et al., 2006Ogunwande, Olawore, et al., 2005
Comment MSDC-RI MSDC-RI

References

Champagnat, Figueredo, et al., 2006
Champagnat, P.; Figueredo, G.; Chalchat, J.-C.; Bessiere, J.-M., Essential oil composition of Vetiveria nigritana from Mali, J. Essent. Oil Res., 2006, 18, 6, 647-649, https://doi.org/10.1080/10412905.2006.9699193 . [all data]

Ogunwande, Olawore, et al., 2005
Ogunwande, I.A.; Olawore, N.O.; Adeleke, K.A.; Ekundayo, O., Volatile constituents from the leaves of Eucalyptus cloeziana F. Muell and E. propinqua Deane Maiden from Nigeria, Flavour Fragr. J., 2005, 20, 6, 637-639, https://doi.org/10.1002/ffj.1516 . [all data]