Cyclohexaneethanol, β,4-dimethyl-, cis-

Kovats' RI, polar column, isothermal

View large format table.

Column type Active phase Temperature (C) I Reference Comment
CapillaryPEG-20M120.1806.Albalgés and Guardino, 1985
CapillaryPEG-20M140.1812.Albalgés and Guardino, 1985
CapillaryPEG-20M160.1819.Albalgés and Guardino, 1985

References

Albalgés and Guardino, 1985
Albalgés, J.; Guardino, X., High resolution gas chromatographic analysis of monocyclic terpene alcohols, J. Hi. Res. Chromatogr. Chromatogr. Comm., 1985, 8, 6, 301-302, https://doi.org/10.1002/jhrc.1240080607 . [all data]