Naphthalene, decahydro-1,1,4a-trimethyl-6-methylene-5-(3-methylene-4-pentenyl)-, [4aS-(4aα,5α,8aβ)]-

Van Den Dool and Kratz RI, non-polar column, temperature ramp

Data compiled by: NIST Mass Spectrometry Data Center, William E. Wallace, director

Column type Capillary
Active phase HP-5MS
Column length (m) 30.
Carrier gas He
Substrate
Column diameter (mm) 0.25
Phase thickness (μm) 0.25
Tstart (C) 60.
Tend (C) 280.
Heat rate (K/min) 4.
Initial hold (min) 5.
Final hold (min)
I 1964.
ReferenceSkaltsa, Mavrommati, et al., 2001
Comment MSDC-RI

References

Skaltsa, Mavrommati, et al., 2001
Skaltsa, H.D.; Mavrommati, A.; Constantinidis, T., A chemotaxonomic investigation of volatile constituents in Stachys subsect. Swainsonianeae (Labiatae), Phytochemistry, 2001, 57, 2, 235-244, https://doi.org/10.1016/S0031-9422(01)00003-6 . [all data]