1,1'-Bicyclohexyl, 2-methyl-, cis-

Condensed phase thermochemistry data

Data compiled by: Hussein Y. Afeefy, Joel F. Liebman, and Stephen E. Stein

Quantity Value Units Method Reference Comment
Δcliquid-7761.kJ/molCcbGoodman and Wise, 1951Stull Westrum & Sinke Hf_condensed=-61.3 kcal/mol; Corresponding Δfliquid = -782. kJ/mol (simple calculation by NIST; no Washburn corrections)

References

Goodman and Wise, 1951
Goodman, I.A.; Wise, P.H., Dicyclic hydrocarbons. II. 2-Alkylbicyclohexyls, J. Am. Chem. Soc., 1951, 73, 850-851. [all data]