3-pentyl-p-cresol

Phase change data

Data compiled by: Thermodynamics Research Center, NIST Boulder Laboratories, Chris Muzny director

Quantity Value Units Method Reference Comment
Tfus283.15KN/ACoulthard, Marshall, et al., 1930Uncertainty assigned by TRC = 2. K

In addition to the Thermodynamics Research Center (TRC) data available from this site, much more physical and chemical property data is available from the following TRC products:

References

Coulthard, Marshall, et al., 1930
Coulthard, C.E.; Marshall, J.; Pyman, F.L., The Variation of Phenol Coefficients in a Homologous Series of Phenols, J. Chem. Soc., 1930, 1930, 280. [all data]