1,2-Cyclopentanediol, trans-

Condensed phase thermochemistry data

Data compiled by: Hussein Y. Afeefy, Joel F. Liebman, and Stephen E. Stein

Quantity Value Units Method Reference Comment
Δcsolid-2906.6 ± 2.9kJ/molCcbJung and Dahmlos, 1942Reanalyzed by Cox and Pilcher, 1970, Original value = -2902. kJ/mol; Corresponding Δfsolid = -490.07 kJ/mol (simple calculation by NIST; no Washburn corrections)
Δcsolid-2901. ± 0.4kJ/molCcbVerkade, Coops, et al., 1928At 288 °K; Corresponding Δfsolid = -495.8 kJ/mol (simple calculation by NIST; no Washburn corrections)

References

Jung and Dahmlos, 1942
Jung, G.; Dahmlos, J., Thermochemische untersuchungen zur frage der drehbarkeit um C-C-bindunge, Z. Phys. Chem., 1942, 190, 230-240. [all data]

Cox and Pilcher, 1970
Cox, J.D.; Pilcher, G., Thermochemistry of Organic and Organometallic Compounds, Academic Press, New York, 1970, 1-636. [all data]

Verkade, Coops, et al., 1928
Verkade, P.E.; Coops, J., Jr.; Maan, Chr.J., Calorimetrische Untersuchungen. XV. Thermochemische studien uber cycloparaffine und ihre derivate: 1. Experimentelle daten fur funf- und sechsgliedrige cyclische diole, Ann., 1928, 467, 217-239. [all data]