Reserpine

Gas phase ion energetics data

Data compiled by: Henry M. Rosenstock, Keith Draxl, Bruce W. Steiner, and John T. Herron

Ionization energy determinations

IE (eV) Method Reference
7.88CTSSlifkin and Allison, 1967

References

Slifkin and Allison, 1967
Slifkin, M.A.; Allison, A.C., Measurement of ionization potentials from contact charge transfer spectra, Nature, 1967, 215, 949. [all data]