Imipramine

Normal alkane RI, non-polar column, isothermal

Data compiled by: NIST Mass Spectrometry Data Center, William E. Wallace, director

Column type PackedPacked
Active phase OV-101OV-101
Column length (m) 2.2.
Carrier gas NitrogenNitrogen
Substrate Chromosorb G (100-120 mesh)Chromosorb G (100-120 mesh)
Column diameter (mm)
Phase thickness (μm)
Temperature (C) 180.200.
I 2208.2210.
ReferenceDubsky, Hána, et al., 1978Dubsky, Hána, et al., 1978
Comment MSDC-RI MSDC-RI

Kovats' RI, non-polar column, isothermal

Data compiled by: NIST Mass Spectrometry Data Center, William E. Wallace, director

Column type CapillaryPackedCapillaryPacked
Active phase DB-1SE-30SPB-1OV-1
Column length (m) 30.2.25.
Carrier gas N2N2He
Substrate  1% se-30 on Anachrom ABS(80-100mesh)
Column diameter (mm) 0.53 0.20
Phase thickness (μm) 1.5
Temperature (C) 275.220.250.200.
I 2262.2212.2262.2210.
ReferenceJapp, Gill, et al., 1987Musumarra, Scarlata, et al., 1987Lora-Tamayo, Rams, et al., 1986Berninger and Möller, 1977
Comment MSDC-RI MSDC-RI MSDC-RI MSDC-RI

Normal alkane RI, non-polar column, custom temperature program

Data compiled by: NIST Mass Spectrometry Data Center, William E. Wallace, director

Column type PackedOtherPackedPacked
Active phase OV-101Methyl SiliconeOV-101OV-101
Column length (m)   2.2.
Carrier gas   NitrogenNitrogen
Substrate   Chromosorb G (100-120 mesh)Chromosorb G (100-120 mesh)
Column diameter (mm)
Phase thickness (μm)
Program not specifiednot specifiednot specifiednot specified
I 2214.2223.2212.2220.
ReferenceMaurer and Pfleger, 1984Ardrey and Moffat, 1981Dubsky, Hána, et al., 1978Dubsky, Hána, et al., 1978
Comment MSDC-RI MSDC-RI MSDC-RI MSDC-RI

References

Dubsky, Hána, et al., 1978
Dubsky, H.; Hána, K.; Komárková, M.; Rittich, B., Pouzití kovatsovych indexu pri toxikologickych analysách, Chem. Listy, 1978, 72, 980-984. [all data]