Barbituric acid, 2-thio-

Phase change data

Data compiled by: William E. Acree, Jr., James S. Chickos

Enthalpy of sublimation

ΔsubH (kJ/mol) Temperature (K) Method Reference Comment
110. ± 4.0430.TEBrunetti and Piacente, 1999Based on data from 400. - 461. K.

References

Brunetti and Piacente, 1999
Brunetti, B.; Piacente, V., Sublimation Enthalpies Study for Barbituric, Tiobarbituric, and Selenobarbituric Acids from Their Vapor Pressure Measurements, J. Chem. Eng. Data, 1999, 44, 4, 809-812, https://doi.org/10.1021/je980300k . [all data]