Cytosine, 5-bromo-N,O-bis(trimethylsilyl)-

Kovats' RI, non-polar column, isothermal

View large format table.

Column type Active phase Temperature (C) I Reference Comment
PackedOV-101160.1615.6Miller, Pacáková, et al., 1976Ar, AW-DMCS Chromosorb W HP; Column length: 2. m
PackedSE-30150.1604.Pacakova, Miller, et al., 1971
PackedOV-101150.1602.Pacakova, Miller, et al., 1971

Kovats' RI, non-polar column, custom temperature program

View large format table.

Column type Active phase I Reference Comment
PackedOV-11614.Yamaji, Kimura, et al., 1978Gas Chrom Q; Column length: 1. m; Program: not specified

References

Miller, Pacáková, et al., 1976
Miller, V.; Pacáková, V.; Smolková, E., Gas-liquid chromatographic analysis of trimethylsilyl derivatives of pyrimidine and purine bases and nucleosides, J. Chromatogr., 1976, 119, 355-367, https://doi.org/10.1016/S0021-9673(00)86799-0 . [all data]

Pacakova, Miller, et al., 1971
Pacakova, V.; Miller, V.; Cernohorsky, I.J., Gas-Liquid Chromatography of Some Pyrimidine Derivatives, Anal. Biochemistry, 1971, 42, 2, 549-554, https://doi.org/10.1016/0003-2697(71)90071-6 . [all data]

Yamaji, Kimura, et al., 1978
Yamaji, A.; Kimura, S.; Kawasaki, H.; Yuki, H., Gas chromatographic analysis of pyrimidine and purine bases by retention indices, Yakugaku Zasshi, 1978, 98, 1, 1536-1541. [all data]