Benzyl chloroformate

Phase change data

Data compiled as indicated in comments:
BS - Robert L. Brown and Stephen E. Stein
AC - William E. Acree, Jr., James S. Chickos

Quantity Value Units Method Reference Comment
Δvap38.5 ± 0.1kJ/molN/ADavies, Finch, et al., 1990Based on data from 293. - 303. K.; AC

Reduced pressure boiling point

Tboil (K) Pressure (bar) Reference Comment
376.20.027Weast and Grasselli, 1989BS

References

Davies, Finch, et al., 1990
Davies, R.H.; Finch, A.; Salem, K., Enthalpies of vaporization and vapour pressures of n-propylchloroformate and benzylchloroformate, Thermochim. Acta, 1990, 170, 213-216. [all data]

Weast and Grasselli, 1989
CRC Handbook of Data on Organic Compounds, 2nd Editon, Weast,R.C and Grasselli, J.G., ed(s)., CRC Press, Inc., Boca Raton, FL, 1989, 1. [all data]