1-(2,2,4,4-tetramethylbutyl)naphthalene

Phase change data

Data compiled by: Thermodynamics Research Center, NIST Boulder Laboratories, Chris Muzny director

Quantity Value Units Method Reference Comment
Tfus259.7KN/AAndreev, 1947Uncertainty assigned by TRC = 2. K

In addition to the Thermodynamics Research Center (TRC) data available from this site, much more physical and chemical property data is available from the following TRC products:

References

Andreev, 1947
Andreev, D.N., Synthesis of Alkylnaphthalenes by Means of Organilithium Compounds, Zh. Obshch. Khim., 1947, 17, 1645-50. [all data]