Androsta-2,4-diene-3,17-diol, 17-acetate 3-(2,2,3,3,4,4,4-heptafluorobutanoate), (17β)-

Kovats' RI, non-polar column, isothermal

View large format table.

Column type Active phase Temperature (C) I Reference Comment
PackedOV-101210.2566.Dehennin, Reiffsteck, et al., 1972Gas Chrom Q; Column length: 1.5 m

References

Dehennin, Reiffsteck, et al., 1972
Dehennin, L.; Reiffsteck, A.; Scholler, R., Halogenated diesters of testosterone. Response to electron capture detection, gas chromatographic and mass spectrometric properties, J. Chromatogr. Sci., 1972, 10, 4, 224-230, https://doi.org/10.1093/chromsci/10.4.224 . [all data]