2,5,8-trimethylnonane

Phase change data

Data compiled by: Thermodynamics Research Center, NIST Boulder Laboratories, Chris Muzny director

Quantity Value Units Method Reference Comment
Tboil463.KN/ASchlenk, 1951Uncertainty assigned by TRC = 4. K

In addition to the Thermodynamics Research Center (TRC) data available from this site, much more physical and chemical property data is available from the following TRC products:

References

Schlenk, 1951
Schlenk, W., Justus Liebigs Ann. Chem., 1951, 573, 142-62. [all data]