s-Indacene,1,2,3,5,6,7,hexahydro-

Gas phase ion energetics data

Data compiled as indicated in comments:
LLK - Sharon G. Lias, Rhoda D. Levin, and Sherif A. Kafafi

Ionization energy determinations

IE (eV) Method Reference Comment
7.94PESantiago, Gandour, et al., 1978LLK

References

Santiago, Gandour, et al., 1978
Santiago, C.; Gandour, R.W.; Houk, K.N.; Nutakul, W.; Cravey, W.E.; Thummel, R.P., Photoelectron and ultraviolet spectra of small-ring fused aromatic molecules as probes of aromatic ring distortions, J. Am. Chem. Soc., 1978, 100, 3730. [all data]