9H-Pyrido[3,4-b]indole, 1-methyl-

Kovats' RI, non-polar column, custom temperature program

View large format table.

Column type Active phase I Reference Comment
PackedSE-302000.Ramsey, Lee, et al., 1980He, Chromosorb G HP (80-100 mesh); Column length: 1.5 m; Program: not specified
PackedOV-1011980.McLinden and Stenhouse, 1979N2, Chromosorb W; Column length: 2. m; Program: not specified

Van Den Dool and Kratz RI, non-polar column, temperature ramp

View large format table.

Column type Active phase I Reference Comment
PackedSE-301920.Perrigo and Peel, 1981N2, Chromosorb W, 130. C @ 2. min, 8. K/min, 290. C @ 8. min; Column length: 1.8 m

Normal alkane RI, non-polar column, temperature ramp

View large format table.

Column type Active phase I Reference Comment
PackedOV-11975.Marozzi, Gambaro, et al., 1982Gas Chrom P, 2.5 K/min; Column length: 2. m; Tstart: 120. C; Tend: 200. C
PackedSE-302000.Marozzi, Gambaro, et al., 1982Gas Chrom P, 2.5 K/min; Column length: 2. m; Tstart: 120. C; Tend: 200. C

Normal alkane RI, non-polar column, custom temperature program

View large format table.

Column type Active phase I Reference Comment
OtherMethyl Silicone1952.Ardrey and Moffat, 1981Program: not specified

Gas phase ion energetics data

Data compiled by: Sharon G. Lias, Rhoda D. Levin, and Sherif A. Kafafi

Ionization energy determinations

IE (eV) Method Reference Comment
7.83 ± 0.06PEDomelsmith and Houk, 1978Vertical value

Phase change data

Data compiled by: William E. Acree, Jr., James S. Chickos

Enthalpy of fusion

ΔfusH (kcal/mol) Temperature (K) Method Reference
6.50509.9DSCBurrows, Miguel, et al., 1996

References

Ramsey, Lee, et al., 1980
Ramsey, J.D.; Lee, T.D.; Osselton, M.D.; Moffat, A.C., Gas-liquid chromatographic retention indices of 296 non-drug substances on SE-30 or OV-1 likely to be encountered in toxicological analyses, J. Chromatogr., 1980, 184, 2, 185-206, https://doi.org/10.1016/S0021-9673(00)85641-1 . [all data]

McLinden and Stenhouse, 1979
McLinden, V.J.; Stenhouse, A.M., A chromatography system for drug identification, Forensic Sci. Int., 1979, 13, 71-79, https://doi.org/10.1016/0379-0738(79)90265-2 . [all data]

Perrigo and Peel, 1981
Perrigo, B.J.; Peel, H.W., The use of retention indices and temperature-programmed gas chromatography in analytical toxicology, J. Chromatogr. Sci., 1981, 19, 5, 219-226, https://doi.org/10.1093/chromsci/19.5.219 . [all data]

Marozzi, Gambaro, et al., 1982
Marozzi, E.; Gambaro, V.; Saligari, E.; Mariani, R.; Lodi, F., Use of the retention index in gas chromatographic studies of drugs, J. Anal. Toxicol., 1982, 6, 4, 185-192, https://doi.org/10.1093/jat/6.4.185 . [all data]

Ardrey and Moffat, 1981
Ardrey, R.E.; Moffat, A.C., Gas-liquid chromatographic retention indices of 1318 substances of toxicological interest on SE-30 or OV-1 stationary phase, J. Chromatogr., 1981, 220, 3, 195-252, https://doi.org/10.1016/S0021-9673(00)81925-1 . [all data]