3,6-Dimethoxy-4-phenanthrol

Normal alkane RI, non-polar column, temperature ramp

View large format table.

Column type Active phase I Reference Comment
CapillaryUltra-22522.Strömberg, Lundberg, et al., 200025. m/0.2 mm/0.11 μm, He, 6. K/min, 320. C @ 6. min; Tstart: 160. C

References

Strömberg, Lundberg, et al., 2000
Strömberg, L.; Lundberg, L.; Neumann, H.; Bobon, B.; Huizer, H.; van der Stelt, N.W., Heroin impurity profiling. A harmonization study for retrospective comparisons, Forensic Sci. Int., 2000, 114, 2, 67-88, https://doi.org/10.1016/S0379-0738(00)00295-4 . [all data]