Coprostane

Kovats' RI, non-polar column, isothermal

View large format table.

Column type Active phase Temperature (C) I Reference Comment
CapillaryMethyl Silicone250.2822.Shlyakhov, 1984
CapillaryOV-101250.2822.Kimble, Maxwell, et al., 1974He; Column length: 23. m; Column diameter: 0.3 mm

Normal alkane RI, non-polar column, isothermal

View large format table.

Column type Active phase Temperature (C) I Reference Comment
CapillaryOV-101240.2786.Krupcik, Rutten, et al., 1976Column length: 30. m; Column diameter: 0.25 mm
CapillaryOV-101251.2804.Krupcik, Rutten, et al., 1976Column length: 30. m; Column diameter: 0.25 mm

References

Shlyakhov, 1984
Shlyakhov, A.F., Gas chromatography in organic geochemistry, Nedra, Moscow, 1984, 221. [all data]

Kimble, Maxwell, et al., 1974
Kimble, B.J.; Maxwell, J.R.; Philp, R.P.; Eglinton, G., Identification of steranes and triterpanes in geolipid extracts by high-resolution gas chromatography and mass spectrometry, Chem. Geol., 1974, 14, 3, 173-198, https://doi.org/10.1016/0009-2541(74)90127-2 . [all data]

Krupcik, Rutten, et al., 1976
Krupcik, J.; Rutten, G.A.F.M.; Rijks, J.A., The influence of temperature on the separation and characterization of steroids on non-polar glass capillary columns, Chem. zvesti, 1976, 30, 4, 469-479. [all data]