β'-Dithiodilactic acid

Condensed phase thermochemistry data

Data compiled as indicated in comments:
ALS - Hussein Y. Afeefy, Joel F. Liebman, and Stephen E. Stein
DH - Eugene S. Domalski and Elizabeth D. Hearing

Quantity Value Units Method Reference Comment
Δcsolid-4028.4 ± 3.8kJ/molCcbHuffman and Ellis, 1935Reanalyzed by Cox and Pilcher, 1970, Original value = -3952.8 ± 3.8 kJ/mol; ALS
Quantity Value Units Method Reference Comment
solid,1 bar274.1J/mol*KN/AHuffman and Ellis, 1935, 2Extrapolation below 90 K, 84.43 J/mol*K.; DH

Constant pressure heat capacity of solid

Cp,solid (J/mol*K) Temperature (K) Reference Comment
239.3296.8Huffman and Ellis, 1935, 2T = 85 to 305 K. Value is unsmoothed experimental datum.; DH

References

Huffman and Ellis, 1935
Huffman, H.M.; Ellis, E.L., Thermal Data. II. The heats of combustion of l-cysteine, of l-cystine, β-thiolactic acid and β,β'-dithiodilactic acid, J. Am. Chem. Soc., 1935, 57, 41-46. [all data]

Cox and Pilcher, 1970
Cox, J.D.; Pilcher, G., Thermochemistry of Organic and Organometallic Compounds, Academic Press, New York, 1970, 1-636. [all data]

Huffman and Ellis, 1935, 2
Huffman, H.M.; Ellis, E.L., Thermal data. III. The heat capacities, entropies and free energies of four organic compounds containing sulfur, J. Am. Chem. Soc., 1935, 57, 46-48. [all data]