1,1-bis(1-methylethoxy)propane

Phase change data

Data compiled by: Thermodynamics Research Center, NIST Boulder Laboratories, Chris Muzny director

Quantity Value Units Method Reference Comment
Tboil146.5KN/AAdams and Adkins, 1925Uncertainty assigned by TRC = 4. K

In addition to the Thermodynamics Research Center (TRC) data available from this site, much more physical and chemical property data is available from the following TRC products:

References

Adams and Adkins, 1925
Adams, E.W.; Adkins, H., Catalysis in Acetal Formation, J. Am. Chem. Soc., 1925, 47, 1358-67. [all data]