Phoshorinane

Phase change data

Data compiled by: William E. Acree, Jr., James S. Chickos

Enthalpy of vaporization

ΔvapH (kJ/mol) Temperature (K) Method Reference Comment
39.9309.A,TStephenson and Malanowski, 1987Based on data from 294. - 345. K. See also Morris, Tamres, et al., 1966.

Enthalpy of sublimation

ΔsubH (kJ/mol) Temperature (K) Method Reference Comment
43.3276.TStephenson and Malanowski, 1987Based on data from 250. - 291. K. See also Morris, Tamres, et al., 1966.

References

Stephenson and Malanowski, 1987
Stephenson, Richard M.; Malanowski, Stanislaw, Handbook of the Thermodynamics of Organic Compounds, 1987, https://doi.org/10.1007/978-94-009-3173-2 . [all data]

Morris, Tamres, et al., 1966
Morris, Harris L.; Tamres, Milton; Searles, Scott, The Addition Compounds of Some Phosphines with Boron Trifluoride, Borane, and Trimethylboron, Inorg. Chem., 1966, 5, 12, 2156-2160, https://doi.org/10.1021/ic50046a017 . [all data]