Solanidan-3-ol, (3β,5α)-

Kovats' RI, non-polar column, isothermal

View large format table.

Column type Active phase Temperature (C) I Reference Comment
CapillaryCP Sil 5 CB270.3137.van Gelder, Jonker, et al., 198850. m/0.22 mm/0.12 μm, H2

References

van Gelder, Jonker, et al., 1988
van Gelder, W.M.J.; Jonker, H.H.; Huizing, H.J.; Scheffer, J.J.C., Capillary gas chromatography of steroidal alkaloids from Solanaceae. Retention indices and simultaneous flame ionization/nitrogen-specific detection, J. Chromatogr., 1988, 442, 133-145, https://doi.org/10.1016/S0021-9673(00)94463-7 . [all data]