Clofenvinfos

Kovats' RI, non-polar column, isothermal

View large format table.

Column type Active phase Temperature (C) I Reference Comment
CapillaryOV-1190.2023.Erdmann, Rochholz, et al., 1992
CapillaryOV-1220.2042.Erdmann, Rochholz, et al., 1992
CapillarySPB-1250.2053.Lora-Tamayo, Rams, et al., 1986He; Column length: 25. m; Column diameter: 0.20 mm

Kovats' RI, non-polar column, custom temperature program

View large format table.

Column type Active phase I Reference Comment
CapillaryHP-52064.Tanabe, Mitobe, et al., 200030. m/0.32 mm/0.25 μm; Program: 50C(1min) => 20C/min => 150C => 10C/min => 280C(4min)

Van Den Dool and Kratz RI, non-polar column, temperature ramp

View large format table.

Column type Active phase I Reference Comment
CapillarySLB-5MS2059.Mondello, Casilli, et al., 200730. m/0.25 mm/0.25 μm, He, 2. K/min; Tstart: 70. C; Tend: 300. C
CapillarySLB-5MS2064.Mondello, Casilli, et al., 200730. m/0.25 mm/0.25 μm, He, 2. K/min; Tstart: 70. C; Tend: 300. C

Normal alkane RI, non-polar column, isothermal

View large format table.

Column type Active phase Temperature (C) I Reference Comment
PackedOV-1190.2030.TSunoda, 1986Helium, Chromosorb W AW DMCS; Column length: 1. m

Normal alkane RI, non-polar column, temperature ramp

View large format table.

Column type Active phase I Reference Comment
PackedOV-12015.TSunoda, 1986Helium, Chromosorb W AW DMCS, 4. K/min, 210. C @ 20. min; Column length: 1. m; Tstart: 140. C

Normal alkane RI, non-polar column, custom temperature program

View large format table.

Column type Active phase I Reference Comment
CapillaryHP-52064.Kawara, Asada, et al., 200530. m/0.25 mm/0.25 μm; Program: 50 0C (1 min) 20 0C/min -> 150 0C 10 0C/min -> 280 0C
CapillaryUltra-12017.Tameo and Kiyos, 1991Program: not specified
CapillaryOV-1, SE-30, Methyl silicone, SP-2100, OV-101, DB-1, etc.2053.Waggott and Davies, 1984Hydrogen; Column length: 50. m; Column diameter: 0.32 mm; Program: not specified

Normal alkane RI, polar column, custom temperature program

View large format table.

Column type Active phase I Reference Comment
CapillaryCarbowax 20M2977.Tameo and Kiyos, 1991Program: not specified

References

Erdmann, Rochholz, et al., 1992
Erdmann, F.; Rochholz, G.; Schütz, H., Retention-indices on OV-1 of approximately 170 commonly used pesticides, Mikrochim. Acta, 1992, 106, 3-6, 219-226, https://doi.org/10.1007/BF01242093 . [all data]

Lora-Tamayo, Rams, et al., 1986
Lora-Tamayo, C.; Rams, M.A.; Chacon, J.M.R., Gas Chromatographic Data for 187 Nitrogen- or Phosphorus-Containing Drugs and Metabolites of Toxicological Interest Analysed on Methyl Silicone Capillary Columns, J. Chromatogr., 1986, 374, 73-85, https://doi.org/10.1016/S0378-4347(00)83254-5 . [all data]

Tanabe, Mitobe, et al., 2000
Tanabe, A.; Mitobe, H.; Kawata, K.; Sakai, M.; Yasuhara, A., New monitoring system for ninety pesticides and related compounds in river water by solid-phase extraction with determination by gas chromatography/mass spectrometry, J. AOAC Int., 2000, 83, 1, 61-77. [all data]

Mondello, Casilli, et al., 2007
Mondello, L.; Casilli, A.; Tranchida, P.Q.; Presti, M.L.; Dugo, P.; Dugo, G., Comprehensive gas chromatography coupled to mass spectrometry for the separation of pesticides in a very complex matrix, Anal. Bioanal. Chem., 2007, 389, 6, 1755-1763, https://doi.org/10.1007/s00216-007-1412-y . [all data]

TSunoda, 1986
TSunoda, N., Simultaneous determination of organophosphorous pesticides in forencis chemistry by gas-liquid chromatography with hydrogen flame ionization detector, Eisei Kagaku, 1986, 32, 2, 91-100, https://doi.org/10.1248/jhs1956.32.91 . [all data]

Kawara, Asada, et al., 2005
Kawara, K.; Asada, T.; Oikawa, K.; Tanabe, A., Multiresidue determination of pesticides in sediments by ultrasonically assisted extraction and gas chromatography/mass spectrometry, J. AOAC International, 2005, 88, 5, 1440-1451. [all data]

Tameo and Kiyos, 1991
Tameo, O.; Kiyos, I., Simultaneous determination of pesticides by capillary gas chromatography, Cannot be traslated (in Japan), 1991, 14, 2, 109-122. [all data]

Waggott and Davies, 1984
Waggott, A.; Davies, I.W., Identification of organic pollutants using linear temperature programmed retention indices (LTPRIs) - Part II, 1984, retrieved from http://dwi.defra.gov.uk/research/completed-research/reports/dwi0383.pdf. [all data]