Eucalyptol

Phase change data

Data compiled as indicated in comments:
BS - Robert L. Brown and Stephen E. Stein
TRC - Thermodynamics Research Center, NIST Boulder Laboratories, Chris Muzny director
AC - William E. Acree, Jr., James S. Chickos

Quantity Value Units Method Reference Comment
Tboil449.5 ± 0.3KAVGN/AAverage of 6 values; Individual data points
Quantity Value Units Method Reference Comment
Tfus274.63KN/AGomes, Serrano, et al., 1988Uncertainty assigned by TRC = 0.1 K; TRC
Quantity Value Units Method Reference Comment
Δvap49.0kJ/molGCHoskovec, Grygarová, et al., 2005Based on data from 313. - 413. K.; AC
Δvap53.2kJ/molGCvan Roon, Parsons, et al., 2002AC

Enthalpy of vaporization

ΔvapH (kJ/mol) Temperature (K) Method Reference Comment
41.1378.TGAHazra, Dollimore, et al., 2002Based on data from 353. - 403. K.; AC
35.6279.AStephenson and Malanowski, 1987Based on data from 264. - 303. K.; AC

In addition to the Thermodynamics Research Center (TRC) data available from this site, much more physical and chemical property data is available from the following TRC products:

Lee's RI, non-polar column, custom temperature program

Data compiled by: NIST Mass Spectrometry Data Center, William E. Wallace, director

Column type Capillary
Active phase Methyl Silicone
Column length (m)
Carrier gas
Substrate
Column diameter (mm)
Phase thickness (μm)
Program not specified
I 169.02
ReferenceEckel, Ross, et al., 1993
Comment MSDC-RI

Kovats' RI, non-polar column, temperature ramp

Data compiled by: NIST Mass Spectrometry Data Center, William E. Wallace, director

Column type CapillaryCapillaryCapillaryCapillaryCapillary
Active phase DB-5MSHP-5MSHP-5MSBP-1DB-5
Column length (m) 30.30.60.30.10.
Carrier gas HeHeHeN2He
Substrate
Column diameter (mm) 0.250.250.250.320.1
Phase thickness (μm) 0.250.250.250.250.1
Tstart (C) 60.60.40.60.60.
Tend (C) 180.280.250.220.240.
Heat rate (K/min) 3.2.3.5.5.
Initial hold (min)  8.1. 5.
Final hold (min) 15.30.20.3.10.
I 1031.1046.1038.1019.1033.
ReferenceAngioni, Barra, et al., 2006Hazzit, Baaliouamer, et al., 2006Jalali-Heravi, Zekavat, et al., 2006Srivastava, Srivastava, et al., 2006Asfaw, Licence, et al., 2005
Comment MSDC-RI MSDC-RI MSDC-RI MSDC-RI MSDC-RI
Column type CapillaryCapillaryCapillaryCapillaryCapillary
Active phase DB-5DB-5MSDB-5DB-5DB-5MS
Column length (m) 30.30.30. 30.
Carrier gas HeHeHelium He
Substrate
Column diameter (mm) 0.250.250.25 0.25
Phase thickness (μm) 0.250.250.25 0.25
Tstart (C) 60.60.60.60.60.
Tend (C) 240.240.255.240.180.
Heat rate (K/min) 3.3.3.3.3.
Initial hold (min)     15.
Final hold (min) 15.
I 1031.1032.1035.1033.1031.
ReferenceBarbosa, Paula, et al., 2005Maia, Andrade, et al., 2005Medina, Lucero, et al., 2005Shatar S., 2005Angioni, Barra, et al., 2004
Comment MSDC-RI MSDC-RI MSDC-RI MSDC-RI MSDC-RI
Column type CapillaryCapillaryCapillaryCapillaryCapillary
Active phase DB-5BPX-5HP-5MSHP-5MSDB-5
Column length (m) 30.25.30.30.50.
Carrier gas H2HeHeHeHe
Substrate
Column diameter (mm) 0.250.220.250.320.32
Phase thickness (μm) 0.250.250.250.250.25
Tstart (C) 40.60.60.70.50.
Tend (C) 280.240.200.250.280.
Heat rate (K/min) 4.3.4.3.5.
Initial hold (min)   1.5.2.
Final hold (min) 30. 15. 10.
I 1035.1052.1033.1028.1048.
ReferenceAvato, Raffo, et al., 2004El-Ghorab, Mansour, et al., 2004Juliani, Zygadlo, et al., 2004Siani, Garrido, et al., 2004Baranauskiene, Venskutonis, et al., 2003
Comment MSDC-RI MSDC-RI MSDC-RI MSDC-RI MSDC-RI
Column type CapillaryCapillaryCapillaryCapillaryCapillary
Active phase HP-5MSHP-5HP-5MSDB-5DB-5
Column length (m) 30.30.30.30.30.
Carrier gas HeHeHeHeHe
Substrate
Column diameter (mm) 0.250.250.250.250.25
Phase thickness (μm) 0.251.0.250.250.25
Tstart (C) 50.40.60.60.60.
Tend (C) 280.250.280.240.240.
Heat rate (K/min) 4.5.3.3.3.
Initial hold (min) 2.1.
Final hold (min) 10.  30.30.
I 1031.1046.1015.1010.1010.
ReferenceBaranauskiene, Venskutonis, et al., 2003, 2Bouzouita, Kachouri, et al., 2003Gkinis, Tzakou, et al., 2003Marongiu, Piras, et al., 2003Marongiu, Piras, et al., 2003
Comment MSDC-RI MSDC-RI MSDC-RI MSDC-RI MSDC-RI
Column type CapillaryCapillaryCapillaryCapillaryCapillary
Active phase HP-5BP-1DB-5DB-5DB-5
Column length (m) 30.25.30.60.25.
Carrier gas HeN2HeHeHe
Substrate
Column diameter (mm) 0.250.550.250.320.22
Phase thickness (μm) 0.250.250.251.0.25
Tstart (C) 60.60.50.40.60.
Tend (C) 280.220.250.230.240.
Heat rate (K/min) 3.5.0.53.3.
Initial hold (min)   5.5.
Final hold (min)  15.10.2.
I 1028.1032.1034.1044.1053.
ReferenceÖzcan, Tzakou, et al., 2003Srivastava, Ahmad, et al., 2003Viña and Murillo, 2003Buchin, Salmon, et al., 2002El-Ghorab, Fadel, et al., 2002
Comment MSDC-RI MSDC-RI MSDC-RI MSDC-RI MSDC-RI
Column type CapillaryCapillaryCapillaryCapillaryCapillary
Active phase HP-5BP-1BP-1BP-1BP-1
Column length (m) 30.25.25.25.25.
Carrier gas HeN2N2N2
Substrate
Column diameter (mm) 0.250.320.550.50.5
Phase thickness (μm) 0.250.250.250.250.25
Tstart (C) 60.60.60.60.60.
Tend (C) 200.220.220.220.220.
Heat rate (K/min) 4.5.5.5.5.
Initial hold (min) 1.
Final hold (min) 15.15.15.10.10.
I 1034.1028.1023.1024.1024.
ReferenceJuliani and Simon, 2002Raina, Srivastava, et al., 2002Raina, Srivastava, et al., 2002, 2Rajeswara Rao, 2002Rao B.R.R., 2002
Comment MSDC-RI MSDC-RI MSDC-RI MSDC-RI MSDC-RI
Column type CapillaryCapillaryCapillaryCapillaryCapillary
Active phase BP-1HP-5BP-1SSP-1DB-1
Column length (m) 30.50.25.30.50.
Carrier gas N2HeN2HeN2
Substrate
Column diameter (mm) 0.320.250.550.320.25
Phase thickness (μm) 0.250.250.250.250.25
Tstart (C) 60.50.60.50.80.
Tend (C) 220.250.220.250.225.
Heat rate (K/min) 5.2.55.2.4.
Initial hold (min)  5. 2.
Final hold (min) 13. 15.5.
I 1020.1034.1023.1011.1016.
ReferenceShawl, Srivastava, et al., 2002Yáñez, Pinzón, et al., 2002Jain, Aggarwal, et al., 2001Nagarajan, Rao, et al., 2001Palá-Paúl, Velasco-Negueruela, et al., 2001
Comment MSDC-RI MSDC-RI MSDC-RI MSDC-RI MSDC-RI
Column type CapillaryCapillaryCapillaryCapillaryCapillary
Active phase BP-1DB-1HP-5DB-1SE-54
Column length (m) 25.30.30.30.30.
Carrier gas N2HeHe He
Substrate
Column diameter (mm) 0.550.250.250.250.26
Phase thickness (μm) 0.250.250.250.250.25
Tstart (C) 60.40.60.80.60.
Tend (C) 220.260.280.225.246.
Heat rate (K/min) 5.2.3.4.3.
Initial hold (min)  5.
Final hold (min) 15.20.
I 1028.1018.1030.1017.1032.
ReferenceRaina, Srivastava, et al., 2001Senatore and Rigano, 2001Tzakou and Couladis, 2001Abella, Cortella, et al., 2000Adams, 2000
Comment MSDC-RI MSDC-RI MSDC-RI MSDC-RI MSDC-RI
Column type CapillaryCapillaryCapillaryCapillaryCapillary
Active phase SE-54DB-5SE-30HP-5HP-5MS
Column length (m) 30.30.25.30.30.
Carrier gas  HeHeHeHe
Substrate
Column diameter (mm) 0.260.260.220.320.25
Phase thickness (μm) 0.250.250.250.250.25
Tstart (C) 60.60.70.70.60.
Tend (C) 246.246.220.250.280.
Heat rate (K/min) 3.3.5.3.3.
Initial hold (min)
Final hold (min)
I 1032.1032.1019.1032.1033.
ReferenceAdams, 2000, 2Adams, 2000, 3Kardali, Velasco-Negueruela, et al., 2000Ramos, Siani, et al., 2000Roussis, Tsoukatou, et al., 2000
Comment MSDC-RI MSDC-RI MSDC-RI MSDC-RI MSDC-RI
Column type CapillaryCapillaryCapillaryCapillaryCapillary
Active phase DB-5DB-5DB-5HP-5DB-5
Column length (m) 30.30.30.30.30.
Carrier gas  He HeHe
Substrate
Column diameter (mm) 0.320.260.250.250.25
Phase thickness (μm)  0.250.250.250.33
Tstart (C) 50.60.50.60.40.
Tend (C) 250.246.235.280.260.
Heat rate (K/min) 3.3.15.4.2.
Initial hold (min) 5. 2. 5.
Final hold (min)   2. 20.
I 1029.1032.1030.1031.1020.
ReferenceTzakou, Harvala, et al., 2000Adams, 1999Dickens, 1999Sajjadi and Ghassemi, 1999Senatore and de Feo, 1999
Comment MSDC-RI MSDC-RI MSDC-RI MSDC-RI MSDC-RI
Column type CapillaryCapillaryCapillaryCapillaryCapillary
Active phase HP-5MSDB-5Methyl SiliconeDB-5CP Sil 5 CB
Column length (m) 30.30.30.30.25.
Carrier gas HeHeHeHe
Substrate
Column diameter (mm) 0.320.250.320.250.25
Phase thickness (μm) 0.250.250.250.25
Tstart (C) 70.60.60.40.60.
Tend (C) 250.240.250.250.280.
Heat rate (K/min) 3.3.2.2.5.
Initial hold (min) 5. 2.5.
Final hold (min)   5.20.
I 1030.1030.1033.1021.1024.
ReferenceSiani, Ramos, et al., 1999da Silva, Andrade, et al., 1999Adegoke, Rao, et al., 1998de Feo, Porta, et al., 1998Kaul and Vats, 1998
Comment MSDC-RI MSDC-RI MSDC-RI MSDC-RI MSDC-RI
Column type CapillaryCapillaryCapillaryCapillaryCapillary
Active phase Methyl SiliconeDB-5DB-5DB-1DB-1
Column length (m) 25.30.30.25.30.
Carrier gas N2HeHeHeHe
Substrate
Column diameter (mm) 0.50.250.250.230.23
Phase thickness (μm)  0.250.250.13
Tstart (C) 60.40.60.60.50.
Tend (C) 220.250.240.200.200.
Heat rate (K/min) 5.2.4.4.3.
Initial hold (min)  5. 2.
Final hold (min)  20.
I 1025.1020.1032.1025.1025.
ReferenceMallavarapu, Rao, et al., 1998Senatore, Urrunaga Soria, et al., 1998Zoghbi, Andrade, et al., 1998Breheret, Talou, et al., 1997Fiorini, Fourasté, et al., 1997
Comment MSDC-RI MSDC-RI MSDC-RI MSDC-RI MSDC-RI
Column type CapillaryCapillaryCapillaryCapillaryCapillary
Active phase DB-5OV-101OV-101HP-1Methyl Silicone
Column length (m) 30.25.25.15.12.
Carrier gas HeN2N2
Substrate
Column diameter (mm) 0.250.250.250.320.5
Phase thickness (μm) 0.250.25
Tstart (C) 60.50.50.40.70.
Tend (C) 240.200.200.240.250.
Heat rate (K/min) 3.5.5.6.4.
Initial hold (min)
Final hold (min)    10.15.
I 1033.1025.1026.1025.1028.1
ReferenceTellez, Estell, et al., 1997von Poser, Menut, et al., 1996Menut, Molangui, et al., 1995Raharivelomanana, Cambon, et al., 1993Rao, Rajanikanth, et al., 1989
Comment MSDC-RI MSDC-RI MSDC-RI MSDC-RI MSDC-RI
Column type CapillaryCapillaryCapillaryCapillary
Active phase OV-1OV-101OV-101DB-1
Column length (m) 23.25.100.60.
Carrier gas H2HeH2He
Substrate
Column diameter (mm) 0.320.310.30.25
Phase thickness (μm) 0.3 0.151.
Tstart (C) 50.60.90.40.
Tend (C) 200.200.220.250.
Heat rate (K/min) 3.2.2.4.
Initial hold (min)
Final hold (min)
I 1016.1026.1026.1055.
ReferenceBicchi, Frattini, et al., 1988Morales and Duque, 1987Gaydou, Randriamiharisoa, et al., 1986Burns and Tingey, 1983
Comment MSDC-RI MSDC-RI MSDC-RI MSDC-RI

Van Den Dool and Kratz RI, non-polar column, custom temperature program

Data compiled by: NIST Mass Spectrometry Data Center, William E. Wallace, director

Column type CapillaryCapillaryCapillaryCapillaryCapillary
Active phase HP-5MSBPX-5DB-5MSSE-52HP-5MS
Column length (m) 30.30.30.30.30.
Carrier gas He HeHeHe
Substrate
Column diameter (mm) 0.250.250.250.320.25
Phase thickness (μm) 0.250.250.250.150.25
Program 50C(4min) => 10C/min => 200C(0.5min) => 20C/min => 260C(5min)35C(5min) => 3C/min => 210C => 40C/min => 240C (4min)50C(3min) => 200C(2min) => 15C/min => 300C(5min)45C => 1C/min => 100C => 5C/min => 250C(10min)50C (3min) => 3C/min => 200C => 6C/min => 240C
I 1030.1042.1030.1031.1031.
ReferencePérez, Navarro, et al., 2007Cardeal, da Silva, et al., 2006Eom S.H., Yang H.S., et al., 2006Sacchetti, Guerrini, et al., 2006Akpulat, Tepe, et al., 2005
Comment MSDC-RI MSDC-RI MSDC-RI MSDC-RI MSDC-RI
Column type CapillaryCapillaryCapillaryCapillaryCapillary
Active phase HP-5CBP-55 % Phenyl methyl siloxaneSPB-1SE-52
Column length (m) 30.30.30.50.30.
Carrier gas HeHeHe He
Substrate Chromosorb W
Column diameter (mm) 0.320.250.320.250.52
Phase thickness (μm) 0.250.250.150.250.15
Program 80 0C 8 K/min -> 150 0C 5 K/min -> 230 0C (10 min)60C => 3C/min => 240C => 10C/min => 280C(10min)45C => 1C/min => 100C => 5C/min => 250C (10min)70C(3min) => 4C/min => 120C => 8C/min => 250C45C => 1C/min => 100C => 5C/min => 250C (10min)
I 1030.1027.1031.1023.1032.
ReferenceGopanraj, Dan, et al., 2005Oliveira, Campos, et al., 2005Sacchetti, Maietti, et al., 2005Díaz-Maroto, Sánchez Palomo, et al., 2004Sacchetti, Medici, et al., 2004
Comment MSDC-RI MSDC-RI MSDC-RI MSDC-RI MSDC-RI
Column type CapillaryCapillaryCapillaryCapillaryCapillary
Active phase SPB-1SE-52CP Sil 8 CBCBP-5HP-5
Column length (m) 27.25.50.50.50.
Carrier gas HeHeHeHeHe
Substrate
Column diameter (mm) 0.250.250.320.250.2
Phase thickness (μm) 0.250.25 0.250.33
Program 60C => 3C/min => 180C => 8C/min => 250C (5min)60C(8min) => 3C/min => 180C => 20C/min => 230C60C (2min) => 5C/min => 160C (1min) => 10C/min => 250C (2min)60C(2min) => 3C/min => 240C => 10C/min => 280C(10min)50C(2min) => 5C/min => 150C => 10C/min => 250C(30min)
I 1018.1027.1033.1026.1031.
ReferenceSanz, Soria, et al., 2004Lorenzo, Loayza, et al., 2003Mockute and Judzentiene, 2003Azevedo, Campos, et al., 2002García, Alvarez, et al., 2002
Comment MSDC-RI MSDC-RI MSDC-RI MSDC-RI MSDC-RI
Column type CapillaryCapillaryCapillaryCapillaryCapillary
Active phase HP-5SE-52DB-5BP-1SE-52
Column length (m) 50.30.30.50.25.
Carrier gas HeH2He H2
Substrate
Column diameter (mm) 0.20.320.250.220.32
Phase thickness (μm) 0.330.420.250.250.40
Program 50C(2min) => 5C/min => 150C => 10C/min => 250C(30min)60C(8min) => 3C/min => 180C => 20C/min => 250C(10min)50C (1min) => 5C/min => 100C => 10C/min => 250C (9min)not specified60 0C (8 min) 3 K/min -> 180 0C 20 K/min -> 250 0C (10 min)
I 1033.1021.1032.1023.1029.
ReferenceGarcía, Alvarez, et al., 2002Lorenzo, Paz, et al., 2002Beaulieu and Grimm, 2001Cavalli, Ranarivelo, et al., 2001Lorenzo, Dellacassa, et al., 2001
Comment MSDC-RI MSDC-RI MSDC-RI MSDC-RI MSDC-RI
Column type CapillaryCapillaryCapillaryCapillaryCapillary
Active phase SE-52BP-1DB-5DB-5SE-54
Column length (m) 30. 30.30.30.
Carrier gas H2 H2H2He
Substrate
Column diameter (mm) 0.32 0.250.250.32
Phase thickness (μm) 0.40 0.250.250.25
Program 60 0C (8 min) 3 K/min -> 180 0C 20 K/min -> 250 0C (10 min)not specified40C(5min) => 2C/min => 220C => 5C/min => 250C(15min)40C(5min) => 2C/min => 220C => 5C/min => 250C(15min)35C(2min) => 40C/min => 65C => 6C/min => 250C
I 1030.1023.1033.1033.1038.
ReferenceLorenzo, Paz, et al., 2001Filippini, Tomi, et al., 2000Boulanger, Chassagne, et al., 1999Boulanger, Chassagne, et al., 1999Jagella and Grosch, 1999
Comment MSDC-RI MSDC-RI MSDC-RI MSDC-RI MSDC-RI
Column type CapillaryCapillaryCapillaryCapillaryCapillary
Active phase SE-54SE-54CP Sil 5 CBBPX-5SE-52
Column length (m) 30.30. 50.60.
Carrier gas HeHe HeHe
Substrate
Column diameter (mm) 0.320.32 0.320.32
Phase thickness (μm) 0.250.25 0.50.40
Program 35C (2min) => 40C/min => 60C (2min) => 6C/min => 180C => 10C/min => 230C (5min)35 0C 40 0C/min -> 60 0C (2 min) 6 0C/min -> 180 0C 10 0C/min -> 230 0Cnot specified0C (5min) => 40C/min => 40C (2min) => 10C/min => 280C45 C (6 min) 3 C/min -> 111 0C 2 C/min -> 160 C 3 C/min -> 300 C (15 min)
I 1031.1031.1027.1060.1033.
ReferenceTairu, Hofmann, et al., 1999Tairu, Hofmann, et al., 1999, 2Chanegriha, Baaliouamer, et al., 1998Elmore, Erbahadir, et al., 1997Mondello, Dugo, et al., 1995
Comment MSDC-RI MSDC-RI MSDC-RI MSDC-RI MSDC-RI

Van Den Dool and Kratz RI, polar column, custom temperature program

Data compiled by: NIST Mass Spectrometry Data Center, William E. Wallace, director

Column type CapillaryCapillaryCapillaryCapillaryCapillary
Active phase Supelcowax-10CP-Wax 52CBDB-WaxBP-20Stabilwax
Column length (m) 30.60.30.25.
Carrier gas HeHeHeHeHe
Substrate
Column diameter (mm) 0.250.250.320.25
Phase thickness (μm) 0.250.250.50.25
Program 35C(8min) => 4C/min => 60C => 6C/min => 160C => 20C/min => 200C(1min)45C(5min) => 10C/min => 80C => 2C/min => 240C40C(5min) => 10C/min => 160C => 15C/min => 230C40C(8min) => 3C/min => 180C => 20C/min => 230C50C(8min) => 4C/min => 180C(10min) => 5C/min => 220C
I 1198.1208.1200.1193.1218.
ReferenceBianchi, Careri, et al., 2007Condurso, Verzera, et al., 2006Hallier, Prost, et al., 2005Lorenzo, Loayza, et al., 2003Hudaib, Speroni, et al., 2002
Comment MSDC-RI MSDC-RI MSDC-RI MSDC-RI MSDC-RI
Column type CapillaryCapillaryCapillaryCapillaryCapillary
Active phase Carbowax 20MCarbowax 20MRTX-WaxSupelcowax-10Carbowax 20M
Column length (m) 25.25.60. 25.
Carrier gas H2H2  H2
Substrate
Column diameter (mm) 0.320.320.25 0.32
Phase thickness (μm) 0.250.250.25 0.25
Program 40C(8min) => 3C/min => 180C => 20C/min => 230C40C(8min) => 3C/min => 180C => 20C/min => 230Cnot specifiednot specified40 0C (8 min) 3 K/min -> 180 0C 20 K/min -> 230 0C
I 1186.1168.1215.1207.1186.
ReferenceLorenzo, Paz, et al., 2002Lorenzo, Paz, et al., 2002Cavalli, Ranarivelo, et al., 2001Chisholm, Wilson, et al., 2001Lorenzo, Dellacassa, et al., 2001
Comment MSDC-RI MSDC-RI MSDC-RI MSDC-RI MSDC-RI
Column type CapillaryCapillaryCapillaryCapillaryCapillary
Active phase Carbowax 20MBP-20FFAPFFAPHP-Innowax
Column length (m) 25. 30.30.30.
Carrier gas H2 HeHeHe
Substrate
Column diameter (mm) 0.32 0.320.320.25
Phase thickness (μm) 0.25 0.250.250.25
Program 40 0C (8 min) 3 K/min -> 180 0C 20 K/min -> 230 0Cnot specified40C(1min) => 40C/min => 60C => 6C/min => 230C35C (2min) => 40C/min => 60C (2min) => 6C/min => 180C => 10C/min => 230C (5min)60C(8min) => 3C/min => 180C(5min) => 40C/min => 250C
I 1167.1209.1187.1194.1210.
ReferenceLorenzo, Paz, et al., 2001Filippini, Tomi, et al., 2000Jagella and Grosch, 1999Tairu, Hofmann, et al., 1999Bisio, Ciarallo, et al., 1998
Comment MSDC-RI MSDC-RI MSDC-RI MSDC-RI MSDC-RI
Column type CapillaryCapillaryCapillary
Active phase BP-20HP-InnowaxCarbowax 20M
Column length (m)  60.150.
Carrier gas HeHe
Substrate
Column diameter (mm)  0.250.75
Phase thickness (μm)  0.25
Program not specified32C(1.5min) => 3C/min => 40C (10min) => 3C/min => 200C (10min)not specified
I 1228.1216.1220.
ReferenceChanegriha, Baaliouamer, et al., 1998Iversen, Jakobsen, et al., 1998Whitfield, Shea, et al., 1981
Comment MSDC-RI MSDC-RI MSDC-RI

References

Gomes, Serrano, et al., 1988
Gomes, A.; Serrano, L.; Fareio, F., Solid-Liquid Equilibria in 1,8-Cineole/TErpenic Hydrocarbon Systems, J. Chem. Eng. Data, 1988, 33, 194. [all data]

Hoskovec, Grygarová, et al., 2005
Hoskovec, Michal; Grygarová, Dana; Cvacka, Josef; Streinz, Ludvík; Zima, Jirí; Verevkin, Sergey P.; Koutek, Bohumír, Determining the vapour pressures of plant volatiles from gas chromatographic retention data, Journal of Chromatography A, 2005, 1083, 1-2, 161-172, https://doi.org/10.1016/j.chroma.2005.06.006 . [all data]

van Roon, Parsons, et al., 2002
van Roon, André; Parsons, John R.; Govers, Harrie A.J., Gas chromatographic determination of vapour pressure and related thermodynamic properties of monoterpenes and biogenically related compounds, Journal of Chromatography A, 2002, 955, 1, 105-115, https://doi.org/10.1016/S0021-9673(02)00200-5 . [all data]

Hazra, Dollimore, et al., 2002
Hazra, Anasuya; Dollimore, David; Alexander, Kenneth, Thermal analysis of the evaporation of compounds used in aromatherapy using thermogravimetry, Thermochimica Acta, 2002, 392-393, 221-229, https://doi.org/10.1016/S0040-6031(02)00104-1 . [all data]

Stephenson and Malanowski, 1987
Stephenson, Richard M.; Malanowski, Stanislaw, Handbook of the Thermodynamics of Organic Compounds, 1987, https://doi.org/10.1007/978-94-009-3173-2 . [all data]