Phenanthrene-9-carboxaldehyde

Normal alkane RI, non-polar column, custom temperature program

View large format table.

Column type Active phase I Reference Comment
CapillaryMethyl Silicone2070.Oda, Yasuhara, et al., 199825. m/0.25 mm/0.25 μm, He; Program: 50 0C (2 min) 20 0C/min -> 160 0C 5 0C/min -> 210 0C 10 0C/min -> 300 0C

Lee's RI, non-polar column, temperature ramp

View large format table.

Column type Active phase I Reference Comment
CapillarySPB-5354.7Knobloch and Engewald, 199340. C @ 2. min, 4. K/min; Column length: 30. m; Column diameter: 0.25 mm; Tend: 300. C

Lee's RI, non-polar column, custom temperature program

View large format table.

Column type Active phase I Reference Comment
CapillaryBP-5354.4Kelly, Bartle, et al., 1992Column length: 25. m; Column diameter: 0.32 mm; Program: XX C X C/min -> 170 C 40 C/min -> 300 C (5 min); Check the values XX and X (bad xerox copy)

Gas phase ion energetics data

Data compiled by: John E. Bartmess

Electron affinity determinations

EA (eV) Method Reference Comment
0.7242 ± 0.0087ECDWentworth, Kao, et al., 1975
0.66 ± 0.14ECDWentworth and Chen, 1967

References

Oda, Yasuhara, et al., 1998
Oda, J.; Yasuhara, A.; Matsunaga, K.; Saito, Y., Identification of polycyclic aromatic hydrocarbons of the particulate accumulated in the tunnel duct of freeway and generation of their oxygenated derivatives, Jpn. J. Toxicol. Environ. Health, 1998, 44, 5, 334-351, https://doi.org/10.1248/jhs1956.44.334 . [all data]

Knobloch and Engewald, 1993
Knobloch, T.; Engewald, W., Identification of some polar polycyclic compounds in emissions from brown-coal-fired residential stoves, J. Hi. Res. Chromatogr., 1993, 16, 4, 239-242, https://doi.org/10.1002/jhrc.1240160407 . [all data]

Kelly, Bartle, et al., 1992
Kelly, G.W.; Bartle, K.D.; Clifford, A.A.; Robinson, R.E., Application of coupled LC-GC to the analysis of the polar fraction of diesel particulate matter, J. Hi. Res. Chromatogr., 1992, 15, 8, 526-530, https://doi.org/10.1002/jhrc.1240150808 . [all data]