9-Anthracenecarbonitrile, 10-(acetyloxy)-

Reaction thermochemistry data

Data compiled by: Hussein Y. Afeefy, Joel F. Liebman, and Stephen E. Stein

Individual Reactions

C34H22N2O4 = 29-Anthracenecarbonitrile, 10-(acetyloxy)-

By formula: C34H22N2O4 = 2C17H11NO2

Quantity Value Units Method Reference Comment
Δr82. ± 2.kJ/molKinDonati, Guarini, et al., 1972solid phase

References

Donati, Guarini, et al., 1972
Donati, D.; Guarini, G.; Sarti-Fantoni, P., Thermal behaviour and monomerization kinetics of 9-CN anthracene and 9-CN, 10-acetoxy anthracene dimers in the solid state, Mol. Cryst. Liq. Cryst., 1972, 17, 187-195. [all data]