Benzenemethanol, 4-amino-α,α-bis(4-aminophenyl)-

Condensed phase thermochemistry data

Data compiled by: Hussein Y. Afeefy, Joel F. Liebman, and Stephen E. Stein

Quantity Value Units Method Reference Comment
Δfsolid199.kJ/molCcbSchmidlin, 1906Author hf298_condensed=36.3 kcal/mol
Δfsolid127.kJ/molCcbSchmidin, 1904The author did not define the isomer
Quantity Value Units Method Reference Comment
Δcsolid-10391.kJ/molCcbSchmidlin, 1906Author hf298_condensed=36.3 kcal/mol
Δcsolid-10391.kJ/molCcbSchmidin, 1904The author did not define the isomer

References

Schmidlin, 1906
Schmidlin, M.J., Recherches chimiques et thermochimiques sur la constitution des rosanilines, Ann. Chim. Phys., 1906, 1, 195-256. [all data]

Schmidin, 1904
Schmidin, M.J., Chaleurs de combustion du triphenylmethyle et de quelques derives du triphenylmethane, Compt. Rend., 1904, 139, 732-733. [all data]