Phenylacetic acid propyl ester

Kovats' RI, non-polar column, isothermal

View large format table.

Column type Active phase Temperature (C) I Reference Comment
CapillaryDB-1160.1309.25Mijin and Antonovic, 200630. m/0.256 mm/0.25 μm, N2
CapillaryDB-5160.1331.02Mijin and Antonovic, 200660. m/0.321 mm/0.25 μm, N2
PackedSE-30200.1325.Haken, Hartley, et al., 1983Chromosorb W AW DMCS; Column length: 3.7 m

Normal alkane RI, non-polar column, custom temperature program

View large format table.

Column type Active phase I Reference Comment
CapillarySE-301300.Vinogradov, 2004Program: not specified

Normal alkane RI, polar column, custom temperature program

View large format table.

Column type Active phase I Reference Comment
CapillaryCarbowax 20M1848.Vinogradov, 2004Program: not specified

References

Mijin and Antonovic, 2006
Mijin, D.; Antonovic, D.G., The temperature dependence of the retention index for n-alkyl esters of acetic, propionic, cyclohexanecarboxylic, benzoic and phenylacetic acid on DB-1 and DB-5 capillary columns, J. Serb. Chem. Soc., 2006, 71, 6, 629-637, https://doi.org/10.2298/JSC0606629M . [all data]

Haken, Hartley, et al., 1983
Haken, J.K.; Hartley, H.N.T.; Srisukh, D., Retention increments of aromatic esters, Chromatographia, 1983, 17, 11, 589-596, https://doi.org/10.1007/BF02261941 . [all data]

Vinogradov, 2004
Vinogradov, B.A., Production, composition, properties and application of essential oils, 2004, retrieved from http://viness.narod.ru. [all data]