Benzene, (1-propylheptyl)-

Reaction thermochemistry data

Data compiled by: Hussein Y. Afeefy, Joel F. Liebman, and Stephen E. Stein

Individual Reactions

Benzene, (1-butylhexyl)- = Benzene, (1-propylheptyl)-

By formula: C16H26 = C16H26

Quantity Value Units Method Reference Comment
Δr-0.01 ± 0.09kJ/molEqkPimerzin, Nesterova, et al., 1986liquid phase; GLC
Δr-0.01 ± 0.09kJ/molEqkPimerzin, Nesterova, et al., 1985liquid phase; AlCl3
Δr-0.01 ± 0.09kJ/molEqkNesterova, Pimerzin, et al., 1984liquid phase; At 341.9 K, see Pimerzin, Nesterova, et al., 1985, see Pimerzin, Nesterova, et al., 1986

Benzene, (1-propylheptyl)- = Benzene, (1-ethyloctyl)-

By formula: C16H26 = C16H26

Quantity Value Units Method Reference Comment
Δr0.09 ± 0.41kJ/molEqkPimerzin, Nesterova, et al., 1985liquid phase; AlCl3
Δr0.09 ± 0.41kJ/molEqkNesterova, Pimerzin, et al., 1984liquid phase; At 322.4 K, see Pimerzin, Nesterova, et al., 1985, see Pimerzin, Nesterova, et al., 1986

References

Pimerzin, Nesterova, et al., 1986
Pimerzin, A.A.; Nesterova, T.N.; Rozhnov, A.M., Equilibria of isomeric transformations and relations between thermodynamic properties of secondary alkylbenzenes, J. Chem. Thermodyn., 1986, 17, 641-648. [all data]

Pimerzin, Nesterova, et al., 1985
Pimerzin, a.A.; Nesterova, T.N.; Rozhnov, A.M., Equilibria of isomeric transformations and relations between thermodynamic properties of secondary alkylbenzenes, J. Chem. Thermodyn., 1985, 17, 641-648. [all data]

Nesterova, Pimerzin, et al., 1984
Nesterova, T.N.; Pimerzin, A.A.; Rozhnov, A.M.; Roshchupkina, I.Ya., Thermodynamics of aromatic hydrocarbons, Probl. Kalorim. Khim. Termodin., Dokl. Vses. Konf., 10th, 1984, 1, 225-227. [all data]