2-Methylene-3-butenoic acid ethyl ester

Gas phase thermochemistry data

Data compiled by: Hussein Y. Afeefy, Joel F. Liebman, and Stephen E. Stein

Quantity Value Units Method Reference Comment
Δfgas-290. ± 3.kJ/molCcbSchjanberg, 1938Heat of formation derived by Cox and Pilcher, 1970

References

Schjanberg, 1938
Schjanberg, E., Die verbrennungswarmen, die refraktionsdaten und die alkalische verseifung der athylester der β-vinylacryl saure und der drei pentinsauren, Z. Phys. Chem., 1938, 181, 430-440. [all data]

Cox and Pilcher, 1970
Cox, J.D.; Pilcher, G., Thermochemistry of Organic and Organometallic Compounds, Academic Press, New York, 1970, 1-636. [all data]