Benzaldehyde, 2-fluoro-

Phase change data

Data compiled by: Robert L. Brown and Stephen E. Stein

Quantity Value Units Method Reference Comment
Tboil448.2KN/AWeast and Grasselli, 1989

Reduced pressure boiling point

Tboil (K) Pressure (bar) Reference
343.0.027PCR Inc., 1990
363.70.061Weast and Grasselli, 1989

References

Weast and Grasselli, 1989
CRC Handbook of Data on Organic Compounds, 2nd Editon, Weast,R.C and Grasselli, J.G., ed(s)., CRC Press, Inc., Boca Raton, FL, 1989, 1. [all data]

PCR Inc., 1990
PCR Inc., Research Chemicals Catalog 1990-1991, PCR Inc., Gainesville, FL, 1990, 1. [all data]