Methanamine, N-butylidene-, N-oxide

Gas phase ion energetics data

Data compiled by: Sharon G. Lias, Rhoda D. Levin, and Sherif A. Kafafi

Ionization energy determinations

IE (eV) Method Reference
8.57 ± 0.05EIThorstad, Undheim, et al., 1975

References

Thorstad, Undheim, et al., 1975
Thorstad, O.; Undheim, K.; El-Gendy, M.A.F., Ionisation potentials in structure analysis of isomeric nitrones, oxaziranes, O-ether oximes acid amides, Org. Mass Spectrom., 1975, 10, 1155. [all data]