Borinic acid, dipropylthio-, phenyl ester

Gas phase ion energetics data

Data compiled by: Sharon G. Lias, Rhoda D. Levin, and Sherif A. Kafafi

Ionization energy determinations

IE (eV) Method Reference Comment
8.77 ± 0.05PEBernardi, Danieli, et al., 1977Vertical value

References

Bernardi, Danieli, et al., 1977
Bernardi, F.; Danieli, R.; Distefano, G.; Modelli, A.; Ricci, A., Photoelectron spectra of substituted dialkylphenylthioboranes, J. Organomet. Chem., 1977, 136, 161. [all data]