3,4-Hexanedione

Van Den Dool and Kratz RI, non-polar column, temperature ramp

Data compiled by: NIST Mass Spectrometry Data Center, William E. Wallace, director

Column type CapillaryCapillaryCapillary
Active phase BPX-5BP-5BP-5
Column length (m) 50.50.50.
Carrier gas He He
Substrate
Column diameter (mm) 0.320.320.32
Phase thickness (μm) 0.25
Tstart (C) 60.60.60.
Tend (C) 250.250.250.
Heat rate (K/min) 4.4.4.
Initial hold (min) 5. 5.
Final hold (min) 10.
I 816.800.800.
ReferenceAmes, Guy, et al., 2001Whitfield and Mottram, 2001Whitfield and Mottram, 1999
Comment MSDC-RI MSDC-RI MSDC-RI

Kovats' RI, non-polar column, isothermal

Data compiled by: NIST Mass Spectrometry Data Center, William E. Wallace, director

Column type Capillary
Active phase SE-30
Column length (m) 40.
Carrier gas
Substrate
Column diameter (mm) 0.35
Phase thickness (μm) 0.35
Temperature (C) 100.
I 773.4
ReferenceTudor, 1997
Comment MSDC-RI

Normal alkane RI, non-polar column, temperature ramp

Data compiled by: NIST Mass Spectrometry Data Center, William E. Wallace, director

Column type CapillaryCapillary
Active phase SLB-5MSHP-1
Column length (m) 10.50.
Carrier gas Helium
Substrate
Column diameter (mm) 0.180.2
Phase thickness (μm) 0.180.33
Tstart (C) 40.60.
Tend (C) 295.250.
Heat rate (K/min) 10.2.
Initial hold (min) 1.5
Final hold (min)  10.
I 804.777.
ReferenceRisticevic, Carasek, et al., 2008Antoniotti, Alezra, et al., 2004
Comment MSDC-RI MSDC-RI

Van Den Dool and Kratz RI, polar column, temperature ramp

Data compiled by: NIST Mass Spectrometry Data Center, William E. Wallace, director

Column type Capillary
Active phase CP-WAX 57CB
Column length (m) 50.
Carrier gas
Substrate
Column diameter (mm) 0.32
Phase thickness (μm)
Tstart (C) 60.
Tend (C) 200.
Heat rate (K/min) 4.
Initial hold (min) 5.
Final hold (min)
I 1135.
ReferenceSalter L.J., Mottram D.S., et al., 1988
Comment MSDC-RI

References

Ames, Guy, et al., 2001
Ames, J.M.; Guy, R.C.E.; Kipping, G.J., Effect of pH, temperature, and moisture on the formation of volatile compounds in glycine/glucose model systems, J. Agric. Food Chem., 2001, 49, 9, 4315-4323, https://doi.org/10.1021/jf010198m . [all data]

Whitfield and Mottram, 2001
Whitfield, F.B.; Mottram, D.S., Heterocyclic volatiles formed by heating cysteine or hydrogen sulfide with 4-hydroxy-5-methyl-3(2H)-furanone at pH 6.5, J. Agric. Food Chem., 2001, 49, 2, 816-822, https://doi.org/10.1021/jf0008644 . [all data]

Whitfield and Mottram, 1999
Whitfield, F.B.; Mottram, D.S., Investigation of the reaction between 4-hydroxy-5-methyl-3(2H)-furanone and cysteine or hydrogen sulfide at pH 4.5, J. Agric. Food Chem., 1999, 47, 4, 1626-1634, https://doi.org/10.1021/jf980980v . [all data]