Berteroin

Van Den Dool and Kratz RI, non-polar column, temperature ramp

View large format table.

Column type Active phase I Reference Comment
CapillaryHP-5MS1554.Afsharypuor and Suleimany, 200230. m/0.25 mm/0.25 μm, He, 4. K/min; Tstart: 60. C; Tend: 275. C

Van Den Dool and Kratz RI, non-polar column, custom temperature program

View large format table.

Column type Active phase I Reference Comment
CapillaryHP-5MS1552.8Andriamaharavo, 201430. m/0.25 mm/0.25 μm, He; Program: 60C (1 min) => 5 C/min => 210C => 10 C/min => 280C (15 min)

Normal alkane RI, non-polar column, temperature ramp

View large format table.

Column type Active phase I Reference Comment
CapillaryHP-11503.Valette, Fernandez, et al., 200650. m/0.2 mm/0.5 μm, He, 2. K/min, 250. C @ 40. min; Tstart: 60. C
CapillaryDB-51535.Miyazawa, Nishiguchi, et al., 200530. m/0.25 mm/0.25 μm, He, 3. K/min; Tstart: 60. C; Tend: 240. C
CapillaryRSL-2001524.Jirovetz, Smith, et al., 200230. m/0.25 mm/0.25 μm, H2, 40. C @ 2. min, 6. K/min, 280. C @ 10. min

Normal alkane RI, polar column, temperature ramp

View large format table.

Column type Active phase I Reference Comment
CapillaryTC-WAX FFS2242.Miyazawa, Maehara, et al., 2002He, 3. K/min; Column length: 60. m; Column diameter: 0.25 mm; Tstart: 60. C; Tend: 240. C

References

Afsharypuor and Suleimany, 2002
Afsharypuor, S.; Suleimany, M., Volatile oil constituents of Brassica oleracea var. gongylodes seeds, J. Essent. Oil Res., 2002, 14, 1, 18-19, https://doi.org/10.1080/10412905.2002.9699748 . [all data]

Andriamaharavo, 2014
Andriamaharavo, N.R., Retention Data. NIST Mass Spectrometry Data Center., NIST Mass Spectrometry Data Center, 2014. [all data]

Valette, Fernandez, et al., 2006
Valette, L.; Fernandez, X.; Poulain, S.; Lizzani-Cuvelier, L.; Loiseau, A.-M., Chemical composition of the volatile extracts from Brassica oleracea L. var. botrytis 'Romanesco' cauliflower seeds, Flavour Fragr. J., 2006, 21, 1, 107-110, https://doi.org/10.1002/ffj.1530 . [all data]

Miyazawa, Nishiguchi, et al., 2005
Miyazawa, M.; Nishiguchi, T.; Yamafuji, C., Volatile components of the leaves of Brassica rapa L. var. perviridis Bailey, Flavour Fragr. J., 2005, 20, 2, 158-160, https://doi.org/10.1002/ffj.1335 . [all data]

Jirovetz, Smith, et al., 2002
Jirovetz, L.; Smith, D.; Buchbauer, G., Aroma compound analysis of Eruca sativa (Brassicaceae) SPME headspace leaf samples using GC, GC-MS, and olfactometry, J. Agric. Food Chem., 2002, 50, 16, 4643-4646, https://doi.org/10.1021/jf020129n . [all data]

Miyazawa, Maehara, et al., 2002
Miyazawa, M.; Maehara, T.; Kurose, K., Composition of the essential oil from the leaves of Eruca sativa, Flavour Fragr. J., 2002, 17, 3, 187-190, https://doi.org/10.1002/ffj.1079 . [all data]