4H-Benz[de]anthracene, 5,6-dihydro-

Phase change data

Data compiled by: Thermodynamics Research Center, NIST Boulder Laboratories, Chris Muzny director

Quantity Value Units Method Reference Comment
Tfus353.6KN/AWender, Greenfield, et al., 1951Uncertainty assigned by TRC = 1.5 K

In addition to the Thermodynamics Research Center (TRC) data available from this site, much more physical and chemical property data is available from the following TRC products:

References

Wender, Greenfield, et al., 1951
Wender, I.; Greenfield, H.; Orchin, M., Chemistry of Oxo and Related Reactions IV. Reductions in the Aromatic Series, J. Am. Chem. Soc., 1951, 73, 2656. [all data]