[1,4]Dioxino[2,3-b]-1,4-dioxin, hexahydro-

Gas phase ion energetics data

Data compiled by: Sharon G. Lias, Rhoda D. Levin, and Sherif A. Kafafi

Ionization energy determinations

IE (eV) Method Reference Comment
8.5PEJorgensen, Norskov-Lauritsen, et al., 1981
9.22PEJorgensen, Norskov-Lauritsen, et al., 1981Vertical value

References

Jorgensen, Norskov-Lauritsen, et al., 1981
Jorgensen, F.S.; Norskov-Lauritsen, L.; Jensen, R.B.; Schroll, G., Polyethers. Structural analysis of the 1,4,5,8-tetraoxadecalins and 2,2'-bis(1,3-dioxolane) by photoelectron spectroscopy, molecular mechanics and molecular orbital calculations, Tetrahedron, 1981, 37, 3671. [all data]