tert-butyl-n-hexyl-amine

Kovats' RI, non-polar column, isothermal

View large format table.

Column type Active phase Temperature (C) I Reference Comment
PackedApiezon L100.1035.Golovnya, Zhuravleva, et al., 1981N2, Chromosorb GAW; Column length: 2.7 m

References

Golovnya, Zhuravleva, et al., 1981
Golovnya, R.V.; Zhuravleva, I.L.; Svetlova, N.I.; Grigor'eva, D.N.; Terenina, M.B.; Gutnik, S.B., Gas-chromatographic behavior of secondary isoaliphatic and alicyclic amines, J. Anal. Chem. USSR (Engl. Transl.), 1981, 36, 4, 501-505. [all data]