1-Azatricyclo[3.3.1.13,7]decane,4-methylene-

Gas phase ion energetics data

Data compiled by: Sharon G. Lias, Rhoda D. Levin, and Sherif A. Kafafi

Ionization energy determinations

IE (eV) Method Reference Comment
7.78 ± 0.02PEWorrell, Verhoeven, et al., 1974Vertical value

References

Worrell, Verhoeven, et al., 1974
Worrell, C.; Verhoeven, J.W.; Speckamp, W.N., Through-bond interaction in 1-aza-adamantane derivatives, Tetrahedron, 1974, 30, 3525. [all data]