1,2-Benzenedicarbothioic acid s,s-bis(4-methylphenyl)ester

Gas phase ion energetics data

Data compiled by: Sharon G. Lias, Rhoda D. Levin, and Sherif A. Kafafi

Appearance energy determinations

Ion AE (eV) Other Products MethodReferenceComment
C15H11O2S+10.1 ± 0.2C6H4(S)CH3EISchwarz, Praefcke, et al., 1973

References

Schwarz, Praefcke, et al., 1973
Schwarz, H.; Praefcke, K.; Martens, J., Organische schwefelverbindungen. III. Elektronenstossinduzierte untersuchungen von arylestern der monothi und dithiophthalsaure und der isomeren 3,3-substituierten phthalide, Tetrahedron, 1973, 29, 2877. [all data]