Bis(cyclopentadienyl)ytterbium chloride

Gas phase ion energetics data

Data compiled by: Henry M. Rosenstock, Keith Draxl, Bruce W. Steiner, and John T. Herron

Ionization energy determinations

IE (eV) Method Reference
8.7 ± 0.1EIMuller, 1969

References

Muller, 1969
Muller, J., Massenspektroskopische Untersuchungen an Tri- und Tetracyclopentadienyl-metall-Komplexen, Chem. Ber., 1969, 102, 152. [all data]