Aletamine

Kovats' RI, non-polar column, isothermal

View large format table.

Column type Active phase Temperature (C) I Reference Comment
PackedOV-101140.1320.Huber, Kenndler, et al., 1979N2; Column length: 2. m
PackedApiezon L140.1311.Huber, Kenndler, et al., 1979
PackedApiezon L140.1311.Donike and Stratmann, 1976Chromosorb W

Kovats' RI, polar column, isothermal

View large format table.

Column type Active phase Temperature (C) I Reference Comment
PackedPEG-20M140.1814.Huber, Kenndler, et al., 1979N2
PackedPEG-20M140.1814.Donike and Stratmann, 1976Chromosorb W

Normal alkane RI, non-polar column, custom temperature program

View large format table.

Column type Active phase I Reference Comment
CapillaryPolydimethyl siloxanes1293.Schutz and Wollrab A., 1988Program: not specified
OtherMethyl Silicone1293.Ardrey and Moffat, 1981Program: not specified

References

Huber, Kenndler, et al., 1979
Huber, J.F.K.; Kenndler, E.; Reich, G., Quantitation of the Information Content of Multi-Dimensional Gas Chromatography and Low- Resolution Mass Spectrometry in the Identification of Doping Drugs, J. Chromatogr., 1979, 172, 1, 15-30, https://doi.org/10.1016/S0021-9673(00)90941-5 . [all data]

Donike and Stratmann, 1976
Donike, M.; Stratmann, D., Gas-chromatographische identifizierung von stimulantien der phenyläthylaminreihe mit hilfe der retnetions-indices, Z. Anal. Chem., 1976, 279, 2, 129-131, https://doi.org/10.1007/BF00440798 . [all data]

Schutz and Wollrab A., 1988
Schutz, H.; Wollrab A., The significance of the retention index in toxicologic analysis II, Pharmazie in unzerer Zeit, 1988, 17, 4, 97-101. [all data]

Ardrey and Moffat, 1981
Ardrey, R.E.; Moffat, A.C., Gas-liquid chromatographic retention indices of 1318 substances of toxicological interest on SE-30 or OV-1 stationary phase, J. Chromatogr., 1981, 220, 3, 195-252, https://doi.org/10.1016/S0021-9673(00)81925-1 . [all data]