Dipropyl sulfoxide

Gas phase thermochemistry data

Data compiled by: Hussein Y. Afeefy, Joel F. Liebman, and Stephen E. Stein

Quantity Value Units Method Reference Comment
Δfgas-255. ± 2.kJ/molCcrMackle and O'Hare, 1961

References

Mackle and O'Hare, 1961
Mackle, H.; O'Hare, P.A.G., Studies in the thermochemistry of sulphoxides. Part 1 - The gas-phase heats of formation of diethyl, di-n-propyl, t-butyl ethyl, allyl ethyl and diphenyl sulphoxides, Trans. Faraday Soc., 1961, 57, 2219-2224. [all data]