4H-Thiopyran, 4-(2,6-diphenyl-4H-thiopyran-4-ylidene)-2,6-diphenyl-

Gas phase ion energetics data

Data compiled by: Sharon G. Lias, John E. Bartmess, Joel F. Liebman, John L. Holmes, Rhoda D. Levin, and W. Gary Mallard

Ionization energy determinations

IE (eV) Method Reference Comment
5.84PETraven, Martirosyan, et al., 1987Vertical value

References

Traven, Martirosyan, et al., 1987
Traven, V.F.; Martirosyan, M.A.; Redchenko, V.V.; Chibisova, T.A., Electronic structure of n systems. II. Photoelectron spectra and occupied orbitals of some n donors which are derivatives and analogs of bipyranylidene, J. Gen. Chem. USSR, 1987, 57, 441. [all data]