Guanine, 1,9-dimethyl-

Gas phase ion energetics data

Data compiled by: Sharon G. Lias and Joel F. Liebman

Ionization energy determinations

IE (eV) Method Reference Comment
8.09PEYu, Kim, et al., 1992Vertical value

References

Yu, Kim, et al., 1992
Yu, M.; Kim, H.S.; LeBreton, P.R., UV photoelectron and theoretical characterization of 2'-deoxyguanosine-5'-phosphate valence electronic propeprties: Changes in structure associated with the B to Z-DNA conformational transition, Biochem. Biophys. Res. Commun., 1992, 184, 16. [all data]