Acrylic acid isoamyl ester

Kovats' RI, non-polar column, isothermal

Data compiled by: NIST Mass Spectrometry Data Center, William E. Wallace, director

Column type CapillaryCapillaryCapillaryPacked
Active phase OV-101OV-101OV-101SE-30
Column length (m) 19.19.19.3.7
Carrier gas N2N2N2He
Substrate    Celatom silanized (62-72 mesh)
Column diameter (mm) 0.280.280.28
Phase thickness (μm)
Temperature (C) 100.120.80.150.
I 939.940.941.940.
ReferenceHorna, Táborský, et al., 1985Horna, Táborský, et al., 1985, 2Horna, Táborský, et al., 1985, 2Ashes and Haken, 1975
Comment MSDC-RI MSDC-RI MSDC-RI MSDC-RI

References

Horna, Táborský, et al., 1985
Horna, A.; Táborský, J.; Churácek, J.; Dufka, O., Chromatography of monomers. IV. Gas-liquid chromatographic studies of C1-C6 n-alkyl and C3-C6 isoalkyl acrylates and their hydrogen halide and halogen addition derivatives, J. Chromatogr., 1985, 348, 141-149, https://doi.org/10.1016/S0021-9673(01)92447-1 . [all data]

Horna, Táborský, et al., 1985, 2
Horna, A.; Táborský, J.; Dufka, O.; Matousek, P.; Churácek, J., Chromatography of monomers. II. Glass capillary gas chromatography of C1-C18 alkyl esters of acrylic and methacrylic acids, J. Chromatogr., 1985, 325, 367-378, https://doi.org/10.1016/S0021-9673(00)96047-3 . [all data]

Ashes and Haken, 1975
Ashes, J.R.; Haken, J.K., Gas chromatography of homologous esters. IX. Structure-retention increments of unsaturated esters, J. Chromatogr., 1975, 111, 1, 171-187, https://doi.org/10.1016/S0021-9673(01)80159-X . [all data]