Octanoic acid, 2-propenyl ester

Van Den Dool and Kratz RI, non-polar column, temperature ramp

Data compiled by: NIST Mass Spectrometry Data Center, William E. Wallace, director

Column type CapillaryPacked
Active phase ZB-1SE-30
Column length (m) 60.
Carrier gas He
Substrate  Celite
Column diameter (mm) 0.25
Phase thickness (μm) 0.25
Tstart (C) 60.75.
Tend (C) 280.228.
Heat rate (K/min) 3.
Initial hold (min)
Final hold (min)
I 1261.1262.
ReferenceHerbrand K., Hammerschmidt F.J., et al., 2007van den Dool and Kratz, 1963
Comment MSDC-RI MSDC-RI

Normal alkane RI, non-polar column, temperature ramp

Data compiled by: NIST Mass Spectrometry Data Center, William E. Wallace, director

Column type Capillary
Active phase Ultra-1
Column length (m) 25.
Carrier gas He
Substrate
Column diameter (mm) 0.32
Phase thickness (μm) 0.25
Tstart (C) 80.
Tend (C) 260.
Heat rate (K/min) 3.
Initial hold (min)
Final hold (min)
I 1257.
ReferenceOkumura, 1991
Comment MSDC-RI

Normal alkane RI, non-polar column, custom temperature program

Data compiled by: NIST Mass Spectrometry Data Center, William E. Wallace, director

Column type Capillary
Active phase SE-30
Column length (m)
Carrier gas
Substrate
Column diameter (mm)
Phase thickness (μm)
Program not specified
I 1265.
ReferenceVinogradov, 2004
Comment MSDC-RI

References

Herbrand K., Hammerschmidt F.J., et al., 2007
Herbrand K.; Hammerschmidt F.J.; Brennecke S.; Liebig M.; Losing G.; Schmidt C.O.; Gatfield I.; Krammer G.; Bertram H.J., Identification of allyl esters in garlic cheese, J. Agric. Food Chem., 2007, 55, 19, 7874-7878, https://doi.org/10.1021/jf0713096 . [all data]

van den Dool and Kratz, 1963
van den Dool, H.; Kratz, P. Dec., A generalization of the retention index system including linear temperature programmed gas-liquid partition chromatography, J. Chromatogr., 1963, 11, 463-471, https://doi.org/10.1016/S0021-9673(01)80947-X . [all data]